record_id,inclusion_crit1,inclusion_crit2,inclusion_crit3,gen_health,distress,brs1,brs2,brs3,brs4,brs5,brs6,phq_1,phq_2,phq_3,phq_4,phq_5,phq_6,phq_7,phq_8,phq_fup,gad_1,gad_2,gad_3,gad_4,gad_5,gad_6,gad_7,gad_fup,socdistance,socdistance_fu___0,socdistance_fu___1,socdistance_fu___2,socdistance_fu___3,socdistance_fu___4,socdistance_fu___5,socdistance_fu___6,socdistance_fu___7,socdistance_fu___8,socdistance_fu_other,covid_1___0,covid_1___1,covid_1___2,covid_1___3,covid_1___4,covid_1___5,covid_1___6,covid_2,covid_4,covid_5,covid_6___0,covid_6___1,covid_6___2,covid_6___3,covid_6___4,covid_6___5,covid_6___6,covid_14,covid_7,covid_8___0,covid_8___1,covid_8___2,covid_8___3,covid_8___4,covid_8___5,covid_8___6,covid_8___7,covid_8___8,covid_8___9,covid_8___10,covid_8___11,covid_7_other,covid_10,covid_13,covid_15,covid_16,covid_17,covid_11,covid_12,covidsochlth_1,covidsochlth_4,covidsochlth_5,covidsochlth_6,covidsochlth_7,covidsochlth_8,covidsochlth_9,covidsochlth_10,covidsochlth_11___0,covidsochlth_11___1,covidsochlth_11___2,covidsochlth_11___3,covidsochlth_11___4,covidsochlth_11___5,covidsochlth_11___6,covidsochlth_11___7,covidsochlth_11___8,covidsochlth_12,covidsochlth_13,covidsochlth_14,covidsochlth_15,covidsochlth_18,covidsochlth_19,covidpos_2,healthinfo_1,healthinfo_2,healthinfo_3,healthinfo3_other,healthinfo_4,med_1,med_2,med_3,med_4,med_5,med_6,med_7,med_8,med_9,med_10,med_11,med_12,med_13,med_hist_1,med_hist_2,dx_cancer,med_hist_4___0,med_hist_4___1,med_hist_4___2,med_hist_4___3,med_hist_4___4,med_hist_4___5,med_hist_4___6,med_hist_4___7,med_hist_4___8,med_hist_4___9,med_hist_4___10,med_hist_4___11,med_hist_4___12,med_hist_4___13,med_hist_4___14,med_hist_4___15,med_hist_4___16,med_hist_4___17,med_hist_4___18,med_hist_4___19,med_hist_4___20,med_hist_4___21,med_hist_4___22,dx_cancer_other,cancer_during_covid,med_hist_7,med_hist_8___0,med_hist_8___1,med_hist_8___2,med_hist_8___3,med_hist_8___4,med_hist_8___5,med_hist_8___6,med_hist_8___7,med_hist_9,med_hist_10,med_hist_11,med_hist_12,med_hist_18,med_hist_13,med_hist_16___0,med_hist_16___1,med_hist_16___2,med_hist_16___3,med_hist_16___4,med_hist_16___5,med_hist_16___6,med_hist_16___7,med_hist_15,trt_change_reason___1,trt_change_reason___2,trt_change_reason___3,trt_change_reason___4,trt_change_reason___5,trt_change_reason___6,trt_change_reason___7,trt_change_reason___8,trt_change_reason___9,med_hist_14,cancer_financial,med_18,med_hist_20___0,med_hist_20___1,med_hist_20___2,med_hist_20___3,med_hist_20___4,med_hist_20___5,med_hist_20___6,med_hist_21,dem_2,dem_4___0,dem_4___1,dem_4___2,dem_4___3,dem_4___4,dem_4___5,dem_4___6,dem_4___7,dem_4___8,dem_4___9,dem_4___10,dem_4___11,dem_4___12,dem_4___13,dem_5___0,dem_5___1,dem_5___2,dem_5___3,ht_feet,ht_inches,dem_7,dem_8,dem_9,dem_10,dem_10_other,dem_12,dem_13,dem_14,dem_15,dem_16,dem_18,dem_19,dem_20,dem_21,survey_complete,stcode,cases,region,region2
1,1,1,1,1,4,4,3,2,1,5,1,0,0,3,2,0,0,0,0,0,0,1,1,2,1,1,0,0,2,1,1,0,1,1,0,1,0,0,,0,0,0,0,0,0,1,0,4,,0,0,0,0,0,0,0,1,0,,,,,,,,,0,,,,,0,2,5,5,1,0,1,50,0,0,44,0,0,0,0,1,0,0,0,0,0,0,0,0,,0,1,6,0,0,no,3,3,10,,4,2,2,2,2,2,2,2,2,2,2,1,2,2,0,0,0,0,0,0,0,0,0,0,0,0,0,0,0,0,0,0,0,0,0,0,0,0,0,0,,,,0,0,0,0,0,0,0,0,,,,,,,0,0,0,0,0,0,0,0,,0,0,0,0,0,0,0,0,0,,,0,0,0,0,0,0,0,0,,1,1,0,0,0,0,0,0,0,0,0,0,0,0,0,1,0,0,0,5,6,160,1,0,,,1,0,0,2,0,2,6,1,,2,PA,5805,7,2
2,1,1,1,1,3,4,2,4,4,4,2,0,0,1,1,0,1,1,0,0,2,1,0,1,0,1,0,1,3,0,1,0,1,0,0,0,0,0,,0,0,0,0,0,0,1,0,4,,0,0,0,0,0,0,0,4,1,1,1,0,0,0,0,0,0,0,0,0,0,,0,5,2,4,4,1,4,84,0,50,34,0,32,4,93,0,0,0,0,0,0,0,0,1,Retired,0,1,4,0,2,No,4,3,10,,4,2,2,1,1,2,2,2,1,2,1,1,1,2,0,0,1,0,0,1,0,0,0,0,0,0,0,0,0,0,0,0,0,0,0,0,0,0,0,0,,0,,0,1,1,1,0,0,0,0,,4,0,,,,0,0,0,0,0,0,0,0,,0,0,0,0,0,0,0,0,0,,,0,0,0,0,0,0,0,0,,1,1,0,0,0,0,0,0,0,0,0,0,0,0,0,1,0,0,0,5,3,143,3,0,,,1,0,0,3,3,4,2,2,,2,ND,147,4,1
3,1,1,1,3,8,5,2,4,2,4,2,0,1,0,1,0,0,2,0,1,2,1,1,1,0,1,0,1,4,1,1,1,1,0,1,0,0,0,,0,1,1,1,0,0,0,2,4,,0,0,0,0,0,0,0,3,2,,,,,,,,,0,,,,,0,5,4,5,5,1,4,77,75,91,98,0,50,3,10,1,0,0,0,0,0,0,0,0,,0,0,1,0,0,,4,5,5,,3,2,2,1,2,2,2,2,1,2,2,2,2,2,2,0,1,0,0,0,0,0,0,0,0,0,0,0,0,0,0,0,0,0,0,0,1,0,0,0,,0,,0,1,1,1,0,0,0,0,,6,0,,,,0,0,0,0,0,0,0,0,,0,0,0,0,0,0,0,0,0,,,2,0,0,0,0,0,0,0,,0,1,0,0,0,0,0,0,0,0,0,0,0,0,0,1,0,0,0,5,5,185,5,0,,,1,1,0,1,6,4,6,1,,2,MN,742,5,1
4,1,1,1,2,3,4,3,2,3,4,4,0,0,1,1,0,1,0,0,0,0,1,0,0,0,0,0,0,4,0,0,0,0,1,1,0,0,0,,0,0,1,0,0,0,0,2,4,,0,0,0,0,0,0,0,4,2,,,,,,,,,0,,,,,3,4,5,2,1,1,3,60,,0,30,0,0,0,98,0,0,0,0,0,0,0,0,1,Retired,0,1,2,0,2,More time with wife,4,1,4,,4,2,2,2,1,2,2,,2,2,2,2,1,,0,1,1,0,0,0,0,0,0,0,0,0,0,0,0,0,0,0,0,0,0,0,0,0,0,1,Brain. GBM4,0,,0,0,1,1,0,0,0,1,Optune medical device,2,2,,,,0,0,0,0,0,0,0,0,,0,0,0,0,0,0,0,0,0,,,0,0,0,0,0,0,0,0,,0,1,0,0,0,0,0,0,0,0,0,0,0,0,0,1,0,0,0,5,11,180,2,0,,,2,0,0,3,7,3,4,1,,2,MN,742,5,1
5,1,1,1,2,3,4,2,4,2,4,2,0,0,1,0,0,0,1,0,0,1,1,1,1,0,1,1,0,3,0,1,1,1,0,1,0,1,0,,1,0,0,0,0,0,0,2,4,,0,0,0,0,0,0,0,3,0,,,,,,,,,0,,,,,0,5,5,2,3,1,4,,,,,,,,,0,1,0,0,0,0,0,0,0,,0,1,1,0,0,No,4,5,5,,3,2,1,2,2,2,2,2,2,2,2,2,2,2,2,0,1,0,0,0,0,0,0,0,0,0,0,0,0,0,0,0,0,0,1,0,0,0,0,0,,0,,0,0,1,1,0,0,0,0,,6,0,,,,0,0,0,0,0,0,0,0,,0,0,0,0,0,0,0,0,0,,,0,0,0,0,0,0,0,0,,0,1,0,0,0,0,0,0,0,0,0,0,0,0,0,1,0,0,0,6,1,220,4,0,,,2,0,0,1,6,3,2,2,,2,MN,742,5,1
6,1,1,1,3,5,5,1,5,1,5,1,0,0,0,1,0,0,0,0,0,0,0,0,0,0,0,1,0,3,1,1,1,1,1,1,1,0,0,,0,0,0,0,0,0,1,0,4,,0,0,0,0,0,0,0,4,1,0,0,1,0,0,0,0,0,0,0,0,0,,0,5,4,5,5,1,4,80,75,99,50,0,80,75,100,0,1,0,0,0,0,0,0,0,,0,1,1,0,0,I have had more time to just be at home so I've cleaned every drawer and closet. My house is whistle clean,4,1,4,,4,1,,,,,,,,,,,,,0,0,1,0,0,0,0,0,0,0,0,0,0,0,0,1,0,0,0,0,0,0,0,0,0,0,,0,,0,0,1,0,1,0,0,0,,0,1,1,2,0,0,0,0,0,0,0,0,0,2,0,0,0,0,0,0,0,0,0,4,0,0,0,0,0,0,0,0,0,,1,1,0,0,0,0,0,0,0,0,0,0,0,0,0,1,0,0,0,5,8,200,4,0,,,4,0,1,1,5,3,4,3,,2,MN,742,5,1
7,1,1,1,2,3,4,2,4,2,4,2,0,0,1,1,2,0,1,0,0,1,1,0,1,0,1,1,1,4,0,1,1,1,1,0,1,1,0,,0,0,0,0,0,0,1,2,4,,0,0,0,0,0,0,0,2,0,,,,,,,,,0,,,,,0,5,3,3,2,1,4,53,19,73,85,14,50,13,91,1,0,0,0,0,0,0,0,0,,0,1,1,0,0,"Yes, I can work from home and don't have my 45 minute commute. I'm taking daily walks and practicing sitting meditation almost every day.",4,4,11,BBC World News and daily briefings from my state CDC director,3,2,2,2,2,2,2,2,1,2,2,2,2,2,0,0,0,0,0,0,0,0,0,0,0,0,0,0,0,0,0,0,0,0,0,0,0,0,0,0,,,,0,0,0,0,0,0,0,0,,,,,,,0,0,0,0,0,0,0,0,,0,0,0,0,0,0,0,0,0,,,0,0,0,0,0,0,0,0,,1,1,0,0,0,0,0,0,0,0,0,0,0,0,0,1,0,0,0,5,3,170,4,0,,,1,0,0,1,2,2,1,2,,2,ME,344,4,1
8,1,1,1,1,8,,,,,,,,,,,,,,,,,,,,,,,,,0,0,0,0,0,0,0,0,0,,0,0,0,0,0,0,0,,,,0,0,0,0,0,0,0,,,,,,,,,,,0,,,,,,,,,,,,,,,,,,,,0,0,0,0,0,0,0,0,0,,,,,,,,,,,,,,,,,,,,,,,,,,,,,0,0,0,0,0,0,0,0,0,0,0,0,0,0,0,0,0,0,0,0,0,0,0,,,,0,0,0,0,0,0,0,0,,,,,,,0,0,0,0,0,0,0,0,,0,0,0,0,0,0,0,0,0,,,,0,0,0,0,0,0,0,,,0,0,0,0,0,0,0,0,0,0,0,0,0,0,0,0,0,0,,,,,,,,,,,,,,,,,0,,,,
9,1,1,1,1,1,5,1,4,2,4,1,,,,,,,,,,,,,,,,,,,0,0,0,0,0,0,0,0,0,,0,0,0,0,0,0,0,,,,0,0,0,0,0,0,0,,,,,,,,,,,0,,,,,,,,,,,,,,,,,,,,0,0,0,0,0,0,0,0,0,,,,,,,,,,,,,,,,,,,,,,,,,,,,,0,0,0,0,0,0,0,0,0,0,0,0,0,0,0,0,0,0,0,0,0,0,0,,,,0,0,0,0,0,0,0,0,,,,,,,0,0,0,0,0,0,0,0,,0,0,0,0,0,0,0,0,0,,,,0,0,0,0,0,0,0,,,0,0,0,0,0,0,0,0,0,0,0,0,0,0,0,0,0,0,,,,,,,,,,,,,,,,,0,,,,
10,1,1,1,3,7,4,4,4,2,3,2,2,2,1,0,0,0,2,0,3,2,1,2,2,0,3,1,2,3,0,0,1,1,0,0,0,0,0,,0,0,0,0,0,0,1,0,4,,0,0,0,0,0,0,0,5,1,0,1,0,0,0,1,0,0,0,0,0,0,,0,5,3,5,5,1,4,90,75,40,10,0,0,0,100,0,1,0,0,0,0,0,0,0,,0,1,1,0,2,The flexibility of telework is a much more enjoyable way for me to work.,4,2,11,Health departments,4,2,2,2,2,2,2,2,2,2,1,1,2,2,0,0,1,0,0,0,0,0,0,0,1,0,0,0,0,0,0,0,0,0,0,0,0,0,0,0,,0,,0,0,1,1,0,1,0,0,,6,0,,,,0,0,0,0,0,0,0,0,,0,0,0,0,0,0,0,0,0,,,0,0,0,0,0,0,0,0,,1,1,0,0,0,0,0,0,0,0,0,0,0,0,0,1,0,0,0,5,2,160,5,0,,,2,0,0,1,4,4,1,2,,2,CO,3342,6,2
11,1,1,1,2,6,,,,,,,,,,,,,,,,,,,,,,,,,0,0,0,0,0,0,0,0,0,,0,0,0,0,0,0,0,,,,0,0,0,0,0,0,0,,,,,,,,,,,0,,,,,,,,,,,,,,,,,,,,0,0,0,0,0,0,0,0,0,,,,,,,,,,,,,,,,,,,,,,,,,,,,,0,0,0,0,0,0,0,0,0,0,0,0,0,0,0,0,0,0,0,0,0,0,0,,,,0,0,0,0,0,0,0,0,,,,,,,0,0,0,0,0,0,0,0,,0,0,0,0,0,0,0,0,0,,,,0,0,0,0,0,0,0,,,0,0,0,0,0,0,0,0,0,0,0,0,0,0,0,0,0,0,,,,,,,,,,,,,,,,,0,,,,
12,1,1,1,,,,,,,,,,,,,,,,,,,,,,,,,,,0,0,0,0,0,0,0,0,0,,0,0,0,0,0,0,0,,,,0,0,0,0,0,0,0,,,,,,,,,,,0,,,,,,,,,,,,,,,,,,,,0,0,0,0,0,0,0,0,0,,,,,,,,,,,,,,,,,,,,,,,,,,,,,0,0,0,0,0,0,0,0,0,0,0,0,0,0,0,0,0,0,0,0,0,0,0,,,,0,0,0,0,0,0,0,0,,,,,,,0,0,0,0,0,0,0,0,,0,0,0,0,0,0,0,0,0,,,,0,0,0,0,0,0,0,,,0,0,0,0,0,0,0,0,0,0,0,0,0,0,0,0,0,0,,,,,,,,,,,,,,,,,0,,,,
13,1,1,1,1,3,5,3,4,2,4,2,0,0,0,0,0,0,3,0,1,0,0,0,0,0,0,1,1,4,0,1,1,1,1,0,0,0,0,,0,0,0,0,0,0,1,2,4,,0,0,0,0,0,0,0,4,1,0,1,0,0,0,0,0,0,0,0,0,0,,1,5,5,5,5,1,1,70,50,,60,0,,,100,0,1,0,0,0,0,0,0,0,,0,1,1,0,2,"I have been pleased with my ability (so far) to make reasonable food choices. Not allowing myself to bring food into my ""office"", restricting myself to 1 diet coke per day, getting lots of water, snacking on fruit/vegetables. I don't know how long I can sustain this, but hope to. I have also been walking mid-day most days and doing video workouts provided by my gym.    Thank you for conducting this survey and for the work you are undoubtedly doing with patients. I know there are many others who are in much worse circumstances than I.",4,3,11,institutional employee FB page related to covid-19,3,2,2,1,2,2,2,2,2,2,1,2,1,2,0,0,1,0,0,0,0,0,0,0,0,0,0,0,0,0,1,0,0,0,0,0,0,0,0,0,,0,,0,0,1,0,0,0,0,0,,3,0,,,,0,0,0,0,0,0,0,0,,0,0,0,0,0,0,0,0,0,,,1,1,0,1,0,0,0,1,follow-up lymphoma visit,1,1,0,0,0,0,0,0,0,0,0,0,0,0,0,1,0,0,0,5,4,158,5,0,,,2,0,0,1,5,4,6,1,,2,MN,742,5,1
14,1,1,1,1,5,4,2,4,2,4,2,1,1,0,1,0,0,1,0,1,1,0,1,,0,2,1,1,4,0,1,1,1,1,1,1,0,0,,0,0,0,0,0,0,1,0,4,,0,0,0,0,0,0,0,2,0,,,,,,,,,0,,,,,0,5,5,2,4,0,4,58,76,3,22,1,70,1,100,0,1,0,0,0,0,0,0,1,Donation Based Non Profit employer / No less donors = mission impact,0,1,7,0,0,"More time as a family, less time at work.  Eating more regularly, not skipping meals and food is home cooked. Talking & video conferencing more with friends.",4,2,11,"BBC, NPR and MN Public Radio",3,2,2,2,2,2,2,2,2,2,1,2,2,2,0,0,0,0,0,0,0,0,0,0,0,0,0,0,0,0,0,0,0,0,0,0,0,0,0,0,,,,0,0,0,0,0,0,0,0,,,,,,,0,0,0,0,0,0,0,0,,0,0,0,0,0,0,0,0,0,,,0,0,0,0,0,0,0,0,,1,1,0,0,0,0,0,0,0,0,0,0,0,0,0,1,0,0,0,5,1,190,5,0,,,2,0,0,1,3,3,2,2,,2,MN,742,5,1
15,1,1,1,3,6,4,3,4,2,3,3,1,1,1,1,3,0,1,0,1,1,0,1,0,0,1,0,1,3,0,1,0,1,1,1,0,1,0,,0,0,1,0,0,0,0,2,4,,0,0,0,0,0,0,0,3,0,,,,,,,,,0,,,,,1,4,4,4,4,0,4,82,99,75,70,89,80,4,98,0,0,0,0,0,0,0,1,0,,0,1,6,0,0,,4,2,2,,4,2,2,2,1,2,2,2,2,2,1,1,2,2,2,1,0,0,0,0,0,0,0,0,0,0,0,0,0,0,0,0,0,0,0,0,0,0,0,0,,,,0,0,0,0,0,0,0,0,,,,,,,0,0,0,0,0,0,0,0,,0,0,0,0,0,0,0,0,0,,,0,0,0,0,0,0,0,0,,1,1,0,0,0,0,0,0,0,0,0,0,0,0,0,1,0,0,0,5,10,310,3,0,,,1,1,0,2,4,1,2,3,,2,PA,5805,7,2
16,1,1,1,3,6,,,,,,,,,,,,,,,,,,,,,,,,,0,0,0,0,0,0,0,0,0,,0,0,0,0,0,0,0,,,,0,0,0,0,0,0,0,,,,,,,,,,,0,,,,,,,,,,,,,,,,,,,,0,0,0,0,0,0,0,0,0,,,,,,,,,,,,,,,,,,,,,,,,,,,,,0,0,0,0,0,0,0,0,0,0,0,0,0,0,0,0,0,0,0,0,0,0,0,,,,0,0,0,0,0,0,0,0,,,,,,,0,0,0,0,0,0,0,0,,0,0,0,0,0,0,0,0,0,,,,0,0,0,0,0,0,0,,,0,0,0,0,0,0,0,0,0,0,0,0,0,0,0,0,0,0,,,,,,,,,,,,,,,,,0,,,,
17,1,1,1,1,3,4,3,3,2,3,3,0,0,2,1,3,0,0,0,1,0,0,0,0,0,0,0,,1,0,1,0,1,0,0,0,0,0,,0,0,0,0,0,0,1,2,4,,0,0,0,0,0,0,0,3,2,,,,,,,,,0,,,,,3,4,2,4,5,1,4,24,1,30,36,20,64,68,99,1,0,1,0,0,0,0,0,0,,1,1,6,0,2,n/a,4,3,10,,3,2,1,1,2,2,2,2,2,1,2,2,2,2,2,1,0,0,0,0,0,0,0,0,0,0,0,0,0,0,0,0,0,0,0,0,0,0,0,0,,,,0,0,0,0,0,0,0,0,,,,,,,0,0,0,0,0,0,0,0,,0,0,0,0,0,0,0,0,0,,,2,0,0,0,0,0,0,0,,1,1,0,0,0,0,0,0,0,0,0,0,0,0,0,1,0,0,0,5,1,165,3,1,4,,1,1,0,2,2,1,4,3,,2,PA,5805,7,2
18,1,1,1,2,7,,2,3,4,2,4,1,1,1,1,1,1,1,1,0,1,0,1,1,0,1,1,0,2,1,1,0,1,1,0,1,1,0,,1,1,0,1,1,0,0,2,4,,0,0,0,0,0,0,0,4,2,,,,,,,,,0,,,,,1,5,5,5,3,1,2,77,99,50,50,1,0,15,99,1,0,1,0,1,0,0,0,0,,0,1,1,0,1,"just that i am losing weight due to being over worked and under staff, working in the healthcare field. According to the bmi scale i am over weight",4,1,1,,3,1,2,2,2,2,2,1,2,2,2,2,2,2,0,0,0,0,0,0,0,0,0,0,0,0,0,0,0,0,0,0,0,0,0,0,0,0,0,0,,,,0,0,0,0,0,0,0,0,,,,,,,0,0,0,0,0,0,0,0,,0,0,0,0,0,0,0,0,0,,,1,0,0,0,1,0,0,0,,1,1,0,0,0,0,0,0,0,0,0,0,0,0,0,1,0,0,0,5,7,210,3,1,8,cna,2,1,1,1,3,2,4,1,,2,PA,5805,7,2
19,1,1,1,,,,,,,,,,,,,,,,,,,,,,,,,,,0,0,0,0,0,0,0,0,0,,0,0,0,0,0,0,0,,,,0,0,0,0,0,0,0,,,,,,,,,,,0,,,,,,,,,,,,,,,,,,,,0,0,0,0,0,0,0,0,0,,,,,,,,,,,,,,,,,,,,,,,,,,,,,0,0,0,0,0,0,0,0,0,0,0,0,0,0,0,0,0,0,0,0,0,0,0,,,,0,0,0,0,0,0,0,0,,,,,,,0,0,0,0,0,0,0,0,,0,0,0,0,0,0,0,0,0,,,,0,0,0,0,0,0,0,,,0,0,0,0,0,0,0,0,0,0,0,0,0,0,0,0,0,0,,,,,,,,,,,,,,,,,0,,,,
20,1,1,1,3,5,3,4,2,4,3,4,1,2,3,3,3,0,1,0,1,2,2,2,2,1,3,0,1,3,0,1,1,1,0,1,1,0,0,,0,0,0,0,0,0,1,0,4,,0,0,0,0,0,0,0,3,0,,,,,,,,,0,,,,,0,4,4,4,4,1,4,50,60,56,71,30,20,0,80,0,1,0,0,0,0,0,0,0,,1,1,6,0,0,N/A,4,1,4,,4,2,2,1,2,2,2,2,2,2,1,1,2,,1,1,0,0,0,0,0,0,0,0,0,0,0,0,0,0,0,0,0,0,0,0,0,0,0,0,,,,0,0,0,0,0,0,0,0,,,,,,,0,0,0,0,0,0,0,0,,0,0,0,0,0,0,0,0,0,,,0,0,0,0,0,0,0,0,,1,1,0,0,0,0,0,0,0,0,0,0,0,0,0,1,0,0,0,5,2,138,1,0,,,3,1,0,0,4,1,4,2,,2,PA,5805,7,2
21,1,1,1,2,7,4,2,3,2,3,2,1,2,1,0,1,0,1,1,1,3,1,1,1,1,1,2,1,4,0,1,1,1,1,1,0,1,0,,0,0,0,0,0,0,1,0,4,,0,0,0,0,0,0,0,5,0,,,,,,,,,0,,,,,1,5,5,4,4,1,4,95,0,30,65,26,27,20,100,1,0,0,0,0,0,0,0,0,,0,1,3,0,2,More walking and jogging outside.,4,3,9,,4,2,2,2,2,2,2,2,2,2,2,1,2,2,0,0,0,0,0,0,0,0,0,0,0,0,0,0,0,0,0,0,0,0,0,0,0,0,0,0,,,,0,0,0,0,0,0,0,0,,,,,,,0,0,0,0,0,0,0,0,,0,0,0,0,0,0,0,0,0,,,0,0,0,0,0,0,0,0,,0,1,0,0,0,0,0,0,0,0,0,0,0,0,0,1,0,0,0,5,7,170,4,0,,,1,0,1,2,4,3,2,2,,2,MN,742,5,1
22,1,1,1,2,4,3,3,3,3,3,3,1,1,1,1,1,1,1,1,1,1,1,1,1,1,1,1,1,1,1,1,1,1,0,0,0,1,0,,0,0,0,0,0,0,1,0,4,,0,0,0,0,0,0,0,2,0,,,,,,,,,0,,,,,1,3,2,2,2,0,0,50,50,50,50,50,50,50,50,1,0,0,0,0,0,0,0,0,,0,1,8,0,0,No,4,1,4,,2,2,2,2,2,2,2,2,2,2,2,2,2,2,0,1,0,0,0,0,0,0,0,0,0,0,0,0,0,0,0,0,0,0,0,0,0,0,0,0,,,,0,0,0,0,0,0,0,0,,,,,,,0,0,0,0,0,0,0,0,,0,0,0,0,0,0,0,0,0,,,0,0,0,0,0,0,0,0,,1,1,0,0,0,0,0,0,0,0,0,0,0,0,0,1,0,0,0,5,3,152,3,0,,,1,0,0,0,3,2,4,2,,2,PA,5805,7,2
23,1,1,1,3,4,4,2,4,2,4,2,1,1,2,1,2,0,0,0,1,2,2,0,1,1,1,2,1,4,0,1,0,1,1,0,1,0,0,,1,1,0,0,0,0,0,2,5,,0,0,0,0,0,0,0,4,1,0,0,0,0,0,0,0,1,0,0,0,0,,0,5,5,4,4,0,4,71,0,84,81,0,23,0,100,1,0,0,0,0,0,0,0,0,,0,1,2,0,0,I'm able to spend more time with my kids. We've been cooking more meals at home. We've been able to exercise more.,4,3,10,,4,1,2,1,1,2,2,,,2,1,1,1,1,0,0,1,0,0,0,0,0,0,0,0,0,0,0,0,0,0,0,0,0,0,0,0,1,0,0,,0,,0,0,0,1,0,0,0,0,,1,0,,,,0,0,0,0,0,0,0,0,,0,0,0,0,0,0,0,0,0,,,0,0,0,0,0,0,0,0,,1,1,0,0,0,0,0,0,0,0,0,0,0,0,0,1,0,0,0,5,4,140,4,0,,,2,1,0,0,4,3,1,2,,2,MN,742,5,1
24,1,1,1,2,4,4,1,4,2,4,2,0,0,0,0,0,1,0,0,0,0,0,0,0,0,0,0,,4,0,1,1,1,0,0,1,0,0,,0,0,0,0,0,0,1,2,4,,0,0,0,0,0,0,0,2,0,,,,,,,,,0,,,,,0,4,3,1,1,1,4,73,0,5,24,0,0,0,100,0,1,0,0,0,0,0,0,0,,0,1,1,0,2,No,4,2,5,,4,1,2,2,2,2,2,2,2,2,2,2,2,2,0,0,0,0,0,0,0,0,0,0,0,0,0,0,0,0,0,0,0,0,0,0,0,0,0,0,,,,0,0,0,0,0,0,0,0,,,,,,,0,0,0,0,0,0,0,0,,0,0,0,0,0,0,0,0,0,,,2,0,0,0,0,0,0,0,,1,1,0,0,0,0,0,0,0,0,0,0,0,0,0,1,0,0,0,,,,5,0,,,2,0,0,1,4,4,2,2,,2,MN,742,5,1
25,1,1,1,2,7,3,3,2,3,2,3,1,2,1,1,2,1,3,0,1,3,1,2,1,0,2,2,1,4,0,1,1,1,1,0,1,1,0,,0,0,1,0,0,0,0,0,4,,0,0,0,0,0,0,0,3,0,,,,,,,,,0,,,,,1,5,4,4,2,1,4,70,2,60,44,6,7,0,84,0,1,0,0,0,0,0,0,1,"Changed to 100% wfh, was 80% before.",0,1,1,0,1,"Increased options for telehealth, which would sometimes be preferable to in-person appointments outside of the pandemic.",4,2,5,,4,2,2,1,2,2,2,2,2,2,1,1,2,2,0,0,0,0,0,0,0,0,0,0,0,0,0,0,0,0,0,0,0,0,0,0,0,0,0,0,,,,0,0,0,0,0,0,0,0,,,,,,,0,0,0,0,0,0,0,0,,0,0,0,0,0,0,0,0,0,,,2,0,0,0,0,0,0,0,,1,1,0,0,0,0,0,0,0,0,0,0,0,0,0,1,0,0,0,5,5,235,4,0,,,2,1,0,1,5,1,1,2,,2,MN,742,5,1
26,1,1,1,3,6,4,2,4,2,4,1,1,2,3,2,3,3,3,1,1,3,2,1,3,1,3,0,2,3,0,1,0,1,1,0,1,1,0,,0,0,0,0,0,0,1,2,4,,0,0,0,0,0,0,0,4,0,,,,,,,,,0,,,,,1,5,5,5,5,0,4,100,79,88,100,69,100,80,100,0,0,0,1,1,0,0,0,0,,1,1,1,0,2,My family and I are spending more time together. I've reconnected with my best friend from middle school. We've chatted and texted more than usual.,4,1,2,,4,2,2,2,2,2,2,2,2,2,1,1,2,2,0,0,0,0,0,0,0,0,0,0,0,0,0,0,0,0,0,0,0,0,0,0,0,0,0,0,,,,0,0,0,0,0,0,0,0,,,,,,,0,0,0,0,0,0,0,0,,0,0,0,0,0,0,0,0,0,,,0,0,0,0,0,0,0,0,,1,1,0,0,0,0,0,0,0,0,0,0,0,0,0,1,0,0,0,5,4,231,4,1,6,,2,1,1,1,1,3,2,2,,2,PA,5805,7,2
27,1,1,1,2,5,4,3,3,3,4,2,1,1,1,2,0,0,0,0,1,1,1,1,1,0,2,1,1,4,1,0,1,1,1,0,0,0,1,O,0,0,1,1,0,0,0,2,4,,0,0,0,0,0,0,0,3,0,,,,,,,,,0,,,,,3,4,4,5,5,0,0,85,90,65,70,10,100,50,75,1,0,0,0,0,0,0,0,1,Part of my job has to be done with others and part can be done from,0,1,5,0,1,"Slowed down a bit. When I stay off the internet days are pretty good overall. Exhausting because I'm balancing keeping young kids happy and working but good. I've been walking a bit more than usual. Had a family reunion via zoom. That was cool. Experiences like drawing with Mo Willems and seeing inside view of Jimmy Fallon's home is cool too. I've been trying to call a friend a day on the phone to stay in touch too, it's been nice catching up with some old friends.  As long as I really limit my news intake and don't over think my fears of",3,2,10,,4,2,2,2,2,2,2,2,2,2,2,2,2,2,0,0,0,0,0,0,0,0,0,0,0,0,0,0,0,0,0,0,0,0,0,0,0,0,0,0,,,,0,0,0,0,0,0,0,0,,,,,,,0,0,0,0,0,0,0,0,,0,0,0,0,0,0,0,0,0,,,0,0,0,0,0,0,0,0,,,0,0,0,0,0,0,0,0,0,0,0,0,0,0,0,0,0,0,,,,4,0,,,2,1,0,1,1,3,4,3,,2,,,,
28,1,1,1,2,5,4,4,4,3,4,4,2,2,2,1,2,2,,1,3,3,2,2,2,2,2,2,3,4,1,1,1,1,1,1,1,1,0,,0,0,0,0,0,0,1,2,4,,0,0,0,0,0,0,0,4,0,,,,,,,,,0,,,,,1,5,5,3,3,1,4,79,11,100,86,39,64,28,93,0,1,0,0,0,0,0,0,0,,0,1,2,0,1,Nice to be with my kids,4,4,7,,3,2,2,2,2,2,,1,2,2,2,2,2,2,0,0,0,0,0,0,0,0,0,0,0,0,0,0,0,0,0,0,0,0,0,0,0,0,0,0,,,,0,0,0,0,0,0,0,0,,,,,,,0,0,0,0,0,0,0,0,,0,0,0,0,0,0,0,0,0,,,0,0,0,0,0,0,0,0,,1,1,0,0,0,0,0,0,0,0,0,0,0,0,0,1,0,0,0,5,7,,5,0,,,2,1,0,1,5,3,2,2,,2,MI,9334,7,2
29,1,1,1,3,6,,,,,,,,,,,,,,,,,,,,,,,,,0,0,0,0,0,0,0,0,0,,0,0,0,0,0,0,0,,,,0,0,0,0,0,0,0,,,,,,,,,,,0,,,,,,,,,,,,,,,,,,,,0,0,0,0,0,0,0,0,0,,,,,,,,,,,,,,,,,,,,,,,,,,,,,0,0,0,0,0,0,0,0,0,0,0,0,0,0,0,0,0,0,0,0,0,0,0,,,,0,0,0,0,0,0,0,0,,,,,,,0,0,0,0,0,0,0,0,,0,0,0,0,0,0,0,0,0,,,,0,0,0,0,0,0,0,,,0,0,0,0,0,0,0,0,0,0,0,0,0,0,0,0,0,0,,,,,,,,,,,,,,,,,0,,,,
30,1,1,1,1,7,3,5,1,3,4,2,1,0,1,1,1,0,1,0,0,1,1,2,1,1,0,1,0,3,1,1,1,1,1,0,0,1,0,,0,0,0,0,0,0,1,2,4,,0,0,0,0,0,0,0,5,0,,,,,,,,,0,,,,,1,4,5,5,5,1,4,63,1,,79,50,79,1,98,0,0,0,0,0,0,0,0,1,retired,0,1,3,0,2,"walking more,",4,1,2,,4,2,2,2,2,2,2,2,2,2,1,1,2,2,0,0,0,0,0,0,0,0,0,0,0,0,0,0,0,0,0,0,0,0,0,0,0,0,0,0,,,,0,0,0,0,0,0,0,0,,,,,,,0,0,0,0,0,0,0,0,,0,0,0,0,0,0,0,0,0,,,0,0,0,0,0,0,0,0,,1,1,0,0,0,0,0,0,0,0,0,0,0,0,0,1,0,0,0,5,3,155,5,0,,,2,0,1,3,6,3,2,3,,2,MN,742,5,1
31,1,1,1,1,6,4,2,4,2,3,4,1,1,0,1,0,0,1,0,1,1,0,0,0,0,0,0,1,4,1,1,1,1,1,1,1,1,1,s,0,0,0,0,0,0,1,2,4,,0,0,0,0,0,0,0,4,1,1,1,0,0,0,1,0,0,0,0,0,0,,2,5,5,5,5,0,4,85,85,65,65,45,75,30,85,0,1,0,0,0,0,0,0,1,It will probably result in decreased working hours and pay in the fu,0,1,3,0,0,"More time to take care of some tasks and projects at home because I am spending less time working, traveling to work, running errands, and participating in social activities with other people.",4,3,10,,3,2,2,2,2,2,2,1,2,2,2,2,2,1,0,0,1,0,0,1,0,0,0,0,0,0,0,0,0,0,0,0,0,0,0,0,0,0,0,0,,0,,0,1,1,1,0,0,0,0,,6,0,,,,0,0,0,0,0,0,0,0,,0,0,0,0,0,0,0,0,0,,,0,0,0,0,0,0,0,0,,1,1,0,0,0,0,0,0,0,0,0,0,0,0,0,1,0,0,0,5,6,148,5,0,,,1,0,1,2,1,2,1,2,,2,MA,7738,7,2
32,1,1,1,3,7,4,2,4,2,4,2,1,1,1,1,0,0,1,0,0,1,1,1,1,0,1,1,1,4,1,1,0,1,1,0,1,1,0,,1,0,1,0,0,0,0,0,4,,0,0,0,0,0,0,0,4,0,,,,,,,,,0,,,,,0,4,5,3,4,1,4,75,100,23,51,100,100,50,100,0,0,0,0,0,0,0,1,0,,0,1,2,0,0,More uninterrupted family time since I'm not shuttling kids today extra curricular activities and sports,4,2,6,,4,2,2,2,2,2,1,2,2,2,2,2,2,2,2,1,0,0,0,0,0,0,0,0,0,0,0,0,0,0,0,0,0,0,0,0,0,0,0,0,,,,0,0,0,0,0,0,0,0,,,,,,,0,0,0,0,0,0,0,0,,0,0,0,0,0,0,0,0,0,,,0,0,0,0,0,0,0,0,,1,0,0,0,0,0,0,0,1,0,0,0,0,0,0,1,0,0,0,5,1,105,4,0,,,2,1,1,2,6,3,2,2,,2,MD,1985,6,2
33,1,1,1,2,4,4,3,4,3,4,2,1,1,1,1,0,0,0,0,0,1,1,1,1,0,1,0,0,3,1,1,1,1,1,0,0,0,0,,0,0,0,0,0,0,1,0,4,,0,0,0,0,0,0,0,2,0,,,,,,,,,0,,,,,0,5,4,4,4,1,4,71,0,67,71,0,50,4,100,1,0,0,0,0,0,0,0,0,,0,1,3,0,0,,4,1,2,,3,2,2,2,2,2,2,2,2,2,2,2,2,,0,0,1,0,0,0,0,0,0,1,0,0,0,0,0,0,0,0,0,0,0,0,0,0,0,0,,0,,0,1,0,1,0,0,0,0,,0,0,1,0,0,0,0,0,0,0,0,0,0,,0,0,0,0,0,0,0,0,0,4,0,0,0,0,0,0,0,0,0,,0,1,0,0,0,0,0,0,0,0,0,0,0,0,0,1,0,0,0,6,2,180,5,0,,,2,0,0,3,6,3,3,2,,2,MN,742,5,1
34,1,1,1,3,7,3,3,2,4,3,3,1,1,2,1,1,0,1,0,1,1,1,2,1,0,0,1,1,4,0,1,1,1,1,1,0,0,0,,0,0,0,0,0,0,1,0,4,,0,0,0,0,0,0,0,5,0,,,,,,,,,0,,,,,0,5,5,4,5,1,4,62,37,75,100,0,21,17,100,0,1,0,1,0,0,0,0,0,,0,1,1,0,0,Exercising more. Eating healthier.,4,1,2,,4,2,2,2,2,2,2,2,2,2,2,2,2,2,0,0,0,0,0,0,0,0,0,0,0,0,0,0,0,0,0,0,0,0,0,0,0,0,0,0,,,,0,0,0,0,0,0,0,0,,,,,,,0,0,0,0,0,0,0,0,,0,0,0,0,0,0,0,0,0,,,1,0,1,0,0,0,0,0,,1,1,0,0,0,0,0,0,0,0,0,0,0,0,0,1,0,0,0,5,6,190,5,1,8,Hea,1,0,0,1,3,4,2,2,,2,IL,6980,7,2
35,1,1,1,2,5,5,3,5,3,4,2,2,1,1,0,2,0,1,0,1,1,0,0,0,1,1,1,0,3,0,1,1,1,1,0,1,0,0,,0,0,1,0,0,0,0,0,4,,0,0,0,0,0,0,0,3,0,,,,,,,,,0,,,,,0,4,4,3,3,1,4,24,64,76,82,26,68,20,79,1,1,0,0,0,0,0,0,0,,0,1,1,0,0,Just way more time at home with roommates. Not hanging out with friends,4,1,2,,3,2,2,2,2,2,2,2,2,2,2,2,2,2,0,0,0,0,0,0,0,0,0,0,0,0,0,0,0,0,0,0,0,0,0,0,0,0,0,0,,,,0,0,0,0,0,0,0,0,,,,,,,0,0,0,0,0,0,0,0,,0,0,0,0,0,0,0,0,0,,,2,0,0,0,0,0,0,0,,0,1,0,0,0,0,0,0,0,0,0,0,0,0,0,1,0,0,0,5,10,175,4,0,,,1,0,0,1,1,4,2,2,,2,MN,742,5,1
36,1,1,1,2,4,4,3,3,3,4,2,1,1,2,3,0,2,1,0,1,3,1,1,1,0,1,3,1,3,1,1,1,1,0,1,0,1,0,,0,0,1,0,0,0,0,2,4,,0,0,0,0,0,0,0,4,0,,,,,,,,,0,,,,,1,5,5,5,3,1,4,100,20,75,100,15,50,70,80,0,1,0,0,0,0,0,0,0,,0,1,1,0,0,,4,2,10,,4,2,2,2,2,2,2,2,2,2,2,2,2,2,0,0,0,0,0,0,0,0,0,0,0,0,0,0,0,0,0,0,0,0,0,0,0,0,0,0,,,,0,0,0,0,0,0,0,0,,,,,,,0,0,0,0,0,0,0,0,,0,0,0,0,0,0,0,0,0,,,1,0,1,1,0,0,0,0,,1,1,0,0,0,0,0,0,0,0,0,0,0,0,0,1,0,0,0,5,2,160,4,0,,,2,1,0,1,3,3,2,2,,2,MN,742,5,1
37,1,1,1,1,5,4,2,3,2,3,2,0,0,0,1,0,0,0,0,1,1,0,0,0,0,0,1,0,3,0,1,1,1,1,0,0,1,0,,0,0,1,0,0,0,0,0,4,,0,0,0,0,0,0,0,4,0,,,,,,,,,0,,,,,2,5,5,4,3,1,4,70,60,20,20,10,25,40,80,0,1,0,0,0,0,0,0,0,,0,1,1,0,2,More attentive to making my house a place I enjoy being in. More quality time with my pets. Sleeping a bit more due to no commute. Going on daily lunchtime walks to the park.,4,3,10,,4,2,2,2,2,2,2,2,2,2,2,2,2,2,0,0,0,0,0,0,0,0,0,0,0,0,0,0,0,0,0,0,0,0,0,0,0,0,0,0,,,,0,0,0,0,0,0,0,0,,,,,,,0,0,0,0,0,0,0,0,,0,0,0,0,0,0,0,0,0,,,0,0,0,0,0,0,0,0,,1,1,0,0,0,0,0,0,0,0,0,0,0,0,0,1,0,0,0,5,6,140,5,0,,,1,0,1,1,4,4,5,5,,2,MN,742,5,1
38,1,1,1,2,7,4,2,4,2,4,2,1,1,0,2,2,2,2,0,1,2,0,1,2,2,3,2,1,4,0,1,1,1,1,1,1,1,0,,1,0,0,0,0,0,0,0,4,,0,0,0,0,0,0,0,4,0,,,,,,,,,0,,,,,1,5,5,4,4,1,4,80,67,78,90,37,68,6,71,0,1,0,0,0,0,0,0,0,,0,1,2,0,1,Less time commuting. Eating more homemade food,4,2,11,MN Health Department,4,2,2,2,2,2,2,2,2,2,2,2,2,2,0,0,0,0,0,0,0,0,0,0,0,0,0,0,0,0,0,0,0,0,0,0,0,0,0,0,,,,0,0,0,0,0,0,0,0,,,,,,,0,0,0,0,0,0,0,0,,0,0,0,0,0,0,0,0,0,,,0,0,0,0,0,0,0,0,,1,1,0,0,0,0,0,0,0,0,0,0,0,0,0,1,0,0,0,5,6,175,5,0,,,2,1,0,1,6,4,2,2,,2,MN,742,5,1
39,1,1,1,3,10,3,5,1,5,3,3,2,2,2,2,2,2,2,2,2,3,3,3,3,3,3,3,3,3,1,1,0,1,1,1,1,1,0,,0,0,0,0,0,0,1,0,4,,0,0,0,0,0,0,0,5,0,,,,,,,,,0,,,,,1,4,5,4,4,1,4,100,100,100,100,100,100,100,100,1,0,0,0,0,0,0,0,0,,1,1,1,0,0,Yes,4,3,10,,4,2,2,1,1,2,2,2,2,2,1,1,2,1,1,0,0,0,0,0,0,0,0,0,0,0,0,0,0,0,0,0,0,0,0,0,0,0,0,0,,,,0,0,0,0,0,0,0,0,,,,,,,0,0,0,0,0,0,0,0,,0,0,0,0,0,0,0,0,0,,,1,0,1,0,0,0,0,0,,1,1,0,0,0,0,0,0,0,0,0,0,0,0,0,1,0,0,0,5,2,210,4,1,1,,1,0,0,1,1,1,1,2,,2,PA,5805,7,2
40,1,1,1,4,7,3,4,3,4,3,4,2,2,3,3,1,2,0,0,2,3,1,1,1,0,1,2,2,3,1,1,0,1,0,0,1,1,0,,0,0,0,0,0,0,1,2,4,,0,0,0,0,0,0,0,5,1,0,0,1,0,0,0,0,0,0,0,0,0,,0,5,5,5,5,0,3,93,17,91,100,85,76,70,96,1,0,0,0,0,0,0,0,0,,0,1,2,0,2,Organizing and cleaning the house,4,2,4,,4,2,1,1,2,2,2,2,1,2,1,1,1,1,0,0,1,0,0,0,0,1,0,0,0,0,0,0,0,0,0,0,0,0,0,0,0,0,0,0,,0,,0,1,1,1,0,0,0,0,,0,1,1,0,1,0,1,0,0,0,0,0,0,2,1,0,0,1,0,0,1,0,0,1,11,0,0,0,0,0,0,0,0,,1,1,0,0,0,0,0,0,0,0,0,0,0,0,0,1,0,0,0,5,9,165,4,0,,,2,0,0,0,4,2,5,3,,2,MN,742,5,1